Reaction Details
TargetSerine/threonine-protein kinase Sgk3
LigandBDBM50355497
Substrate/Competitorn/a
Meas. Tech.ChEMBL_774553 (CHEMBL1908770)
Kd>10000±n/a nM
Citation Davis, MIHunt, JPHerrgard, SCiceri, PWodicka, LMPallares, GHocker, MTreiber, DKZarrinkar, PP Comprehensive analysis of kinase inhibitor selectivity. Nat Biotechnol29:1046-51 (2011) 
 
Serine/threonine-protein kinase Sgk3
Name:Serine/threonine-protein kinase Sgk3
Type:PROTEIN
Mol. Mass.:57110.99
Organism:Homo sapiens (Human)
Description:ChEMBL_1445194
Residue:496
BDBM50355497
NameBDBM50355497
Synonyms:AZD-6244 | CHEMBL1614701
TypeSmall organic molecule
Emp. Form.C17H15BrClFN4O3
Mol. Mass.457.681
SMILESCn1cnc2c(F)c(Nc3ccc(Br)cc3Cl)c(cc12)C(=O)NOCCO