Reaction Details
TargetCyclin-dependent kinase 7
LigandBDBM50332294
Substrate/Competitorn/a
Meas. Tech.ChEMBL_774325 (CHEMBL1908542)
Kd 120±n/a nM
Citation Davis, MIHunt, JPHerrgard, SCiceri, PWodicka, LMPallares, GHocker, MTreiber, DKZarrinkar, PP Comprehensive analysis of kinase inhibitor selectivity. Nat Biotechnol29:1046-51 (2011) 
 
Cyclin-dependent kinase 7
Name:Cyclin-dependent kinase 7
Type:Enzyme Subunit
Mol. Mass.:39047.01
Organism:Homo sapiens (Human)
Description:n/a
Residue:346
BDBM50332294
NameBDBM50332294
Synonyms:CHEMBL1287853 US10112907, Example 00018 US10766894, Compound TABLE 1.3 US11384069, Example T-5
TypeSmall organic molecule
Emp. Form.C27H36N6O3S
Mol. Mass.524.678
SMILESCc1cnc(Nc2ccc(OCCN3CCCC3)cc2)nc1Nc1cccc(c1)S(=O)(=O)NC(C)(C)C