Reaction Details
TargetSerine/threonine-protein kinase DCLK3
LigandBDBM5931
Substrate/Competitorn/a
Meas. Tech.ChEMBL_774187 (CHEMBL1908404)
Kd 1600±n/a nM
Citation Davis, MIHunt, JPHerrgard, SCiceri, PWodicka, LMPallares, GHocker, MTreiber, DKZarrinkar, PP Comprehensive analysis of kinase inhibitor selectivity. Nat Biotechnol29:1046-51 (2011) 
 
Serine/threonine-protein kinase DCLK3
Name:Serine/threonine-protein kinase DCLK3
Type:PROTEIN
Mol. Mass.:73837.68
Organism:Homo sapiens (Human)
Description:ChEMBL_586565
Residue:648
BDBM5931
NameBDBM5931
Synonyms:BMS-387072 N-(5-{[(5-tert-butyl-1,3-oxazol-2-yl)methyl]sulfanyl}-1,3-thiazol-2-yl)piperidine-4-carboxamide cid_3025986
TypeSmall organic molecule
Emp. Form.C17H24N4O2S2
Mol. Mass.380.528
SMILESCC(C)(C)c1cnc(CSc2cnc(NC(=O)C3CCNCC3)s2)o1