Reaction Details
TargetCasein kinase I isoform alpha
LigandBDBM50355496
Substrate/Competitorn/a
Meas. Tech.ChEMBL_774326 (CHEMBL1908543)
Kd 1200±n/a nM
Citation Davis, MIHunt, JPHerrgard, SCiceri, PWodicka, LMPallares, GHocker, MTreiber, DKZarrinkar, PP Comprehensive analysis of kinase inhibitor selectivity. Nat Biotechnol29:1046-51 (2011) 
 
Casein kinase I isoform alpha
Name:Casein kinase I isoform alpha
Type:Serine/threonine-protein kinase
Mol. Mass.:38936.59
Organism:Homo sapiens (Human)
Description:P48729
Residue:337
BDBM50355496
NameBDBM50355496
Synonyms:CHEMBL1908397
TypeSmall organic molecule
Emp. Form.C20H20N4O
Mol. Mass.332.399
SMILESO=C(N1CCNCC1)c1ccc(\C=C\c2n[nH]c3ccccc23)cc1