Reaction Details
TargetHomeodomain-interacting protein kinase 2
LigandBDBM24654
Substrate/Competitorn/a
Meas. Tech.ChEMBL_774609 (CHEMBL1908826)
Kd>10000±n/a nM
Citation Davis, MIHunt, JPHerrgard, SCiceri, PWodicka, LMPallares, GHocker, MTreiber, DKZarrinkar, PP Comprehensive analysis of kinase inhibitor selectivity. Nat Biotechnol29:1046-51 (2011) 
 
Homeodomain-interacting protein kinase 2
Name:Homeodomain-interacting protein kinase 2
Type:Protein
Mol. Mass.:131001.90
Organism:Homo sapiens (Human)
Description:Q9H2X6
Residue:1198
BDBM24654
NameBDBM24654
Synonyms:4-N-(2,6-dichlorobenzene)-3-N-(piperidin-4-yl)-1H-pyrazole-3,4-diamido JMC514986 Compound 33 | pyrazole diamide, 33
TypeSmall organic molecule
Emp. Form.C16H17Cl2N5O2
Mol. Mass.382.244
SMILESClc1cccc(Cl)c1C(=O)Nc1cn[nH]c1C(=O)NC1CCNCC1