Reaction Details
TargetSerine/threonine-protein kinase 32A
LigandBDBM13336
Substrate/Competitorn/a
Meas. Tech.ChEMBL_774301 (CHEMBL1908518)
Kd 1300±n/a nM
Citation Davis, MIHunt, JPHerrgard, SCiceri, PWodicka, LMPallares, GHocker, MTreiber, DKZarrinkar, PP Comprehensive analysis of kinase inhibitor selectivity. Nat Biotechnol29:1046-51 (2011) 
 
Serine/threonine-protein kinase 32A
Name:Serine/threonine-protein kinase 32A
Type:PROTEIN
Mol. Mass.:46373.69
Organism:Homo sapiens (Human)
Description:ChEMBL_774301
Residue:396
BDBM13336
NameBDBM13336
Synonyms:4-[4-(4-fluorophenyl)-2-(4-methanesulfinylphenyl)-1H-imidazol-5-yl]pyridine 4-{4-(4-fluorophenyl)-2-[4-(methylsulfinyl)phenyl]-1H-imidazol-5-yl}pyridine SB-203580 cid_176155
TypeSmall organic molecule
Emp. Form.C21H16FN3OS
Mol. Mass.377.435
SMILESCS(=O)c1ccc(cc1)-c1nc(c([nH]1)-c1ccc(F)cc1)-c1ccncc1