Reaction Details
TargetPeripheral plasma membrane protein CASK
LigandBDBM4779
Substrate/Competitorn/a
Meas. Tech.ChEMBL_774229 (CHEMBL1908446)
Kd>10000±n/a nM
Citation Davis, MIHunt, JPHerrgard, SCiceri, PWodicka, LMPallares, GHocker, MTreiber, DKZarrinkar, PP Comprehensive analysis of kinase inhibitor selectivity. Nat Biotechnol29:1046-51 (2011) 
 
Peripheral plasma membrane protein CASK
Name:Peripheral plasma membrane protein CASK
Type:PROTEIN
Mol. Mass.:105119.01
Organism:Homo sapiens (Human)
Description:ChEMBL_774229
Residue:926
BDBM4779
NameBDBM4779
Synonyms:CHEMBL31965 CI-1033 N-{4-[(3-chloro-4-fluorophenyl)amino]-7-[3-(morpholin-4-yl)propoxy]quinazolin-6-yl}prop-2-enamide US10507209, Compound CI-1033 cid_156414
TypeSmall organic molecule
Emp. Form.C24H25ClFN5O3
Mol. Mass.485.938
SMILESFc1ccc(Nc2ncnc3cc(OCCCN4CCOCC4)c(NC(=O)C=C)cc23)cc1Cl