Reaction Details
TargetCalcium-dependent protein kinase 1
LigandBDBM5446
Substrate/Competitorn/a
Meas. Tech.ChEMBL_774239 (CHEMBL1908456)
Kd>10000±n/a nM
Citation Davis, MIHunt, JPHerrgard, SCiceri, PWodicka, LMPallares, GHocker, MTreiber, DKZarrinkar, PP Comprehensive analysis of kinase inhibitor selectivity. Nat Biotechnol29:1046-51 (2011) 
 
Calcium-dependent protein kinase 1
Name:Calcium-dependent protein kinase 1
Type:PROTEIN
Mol. Mass.:60804.87
Organism:Plasmodium Falciparum
Description:P62343
Residue:524
BDBM5446
NameBDBM5446
Synonyms:CHEMBL553 Erlotinib N-(3-Ethynylphenyl)-6,7-bis(2-methoxyethoxy)-4-quinazolinamine Monohydrochloride OSI-774 US10189853, erlotinib US11524945, Compound Erlotinib US9730934, Erlotinib cid_176870
TypeSmall organic molecule
Emp. Form.C22H23N3O4
Mol. Mass.393.4357
SMILESCOCCOc1cc2ncnc(Nc3cccc(c3)C#C)c2cc1OCCOC