Reaction Details
TargetSRSF protein kinase 3
LigandBDBM32362
Substrate/Competitorn/a
Meas. Tech.ChEMBL_774558 (CHEMBL1908775)
Kd>10000±n/a nM
Citation Davis, MIHunt, JPHerrgard, SCiceri, PWodicka, LMPallares, GHocker, MTreiber, DKZarrinkar, PP Comprehensive analysis of kinase inhibitor selectivity. Nat Biotechnol29:1046-51 (2011) 
 
SRSF protein kinase 3
Name:SRSF protein kinase 3
Type:PROTEIN
Mol. Mass.:62021.04
Organism:Homo sapiens (Human)
Description:ChEMBL_655942
Residue:567
BDBM32362
NameBDBM32362
Synonyms:5-[[3-methoxy-4-[(4-methoxyphenyl)methoxy]phenyl]methyl]pyrimidine-2,4-diamine [2-amino-5-(3-methoxy-4-p-anisyloxy-benzyl)pyrimidin-4-yl]amine | cid_11617559
TypeSmall organic molecule
Emp. Form.C20H22N4O3
Mol. Mass.366.4137
SMILESCOc1ccc(COc2ccc(Cc3cnc(N)nc3N)cc2OC)cc1