Reaction Details
TargetBone morphogenetic protein receptor type-1A
LigandBDBM50355504
Substrate/Competitorn/a
Meas. Tech.ChEMBL_774425 (CHEMBL1908642)
Kd>10000±n/a nM
Citation Davis, MIHunt, JPHerrgard, SCiceri, PWodicka, LMPallares, GHocker, MTreiber, DKZarrinkar, PP Comprehensive analysis of kinase inhibitor selectivity. Nat Biotechnol29:1046-51 (2011) 
 
Bone morphogenetic protein receptor type-1A
Name:Bone morphogenetic protein receptor type-1A
Type:Enzyme
Mol. Mass.:60204.46
Organism:Homo sapiens (Human)
Description:P36894
Residue:532
BDBM50355504
NameBDBM50355504
Synonyms:CHEMBL1908393
TypeSmall organic molecule
Emp. Form.C34H36F2N4O6
Mol. Mass.634.6696
SMILESCOc1cc2c(Oc3ccc(NC(=O)C4(CC4)C(=O)NC4=CCC(F)C=C4)cc3F)ccnc2cc1OCCCN1CCOCC1