Reaction Details
TargetcAMP-dependent protein kinase catalytic subunit PRKX
LigandBDBM50355504
Substrate/Competitorn/a
Meas. Tech.ChEMBL_774456 (CHEMBL1908673)
Kd>10000±n/a nM
Citation Davis, MIHunt, JPHerrgard, SCiceri, PWodicka, LMPallares, GHocker, MTreiber, DKZarrinkar, PP Comprehensive analysis of kinase inhibitor selectivity. Nat Biotechnol29:1046-51 (2011) 
 
cAMP-dependent protein kinase catalytic subunit PRKX
Name:cAMP-dependent protein kinase catalytic subunit PRKX
Type:Enzyme Catalytic Domain
Mol. Mass.:40897.91
Organism:Homo sapiens (Human)
Description:gi_4826948
Residue:358
BDBM50355504
NameBDBM50355504
Synonyms:CHEMBL1908393
TypeSmall organic molecule
Emp. Form.C34H36F2N4O6
Mol. Mass.634.6696
SMILESCOc1cc2c(Oc3ccc(NC(=O)C4(CC4)C(=O)NC4=CCC(F)C=C4)cc3F)ccnc2cc1OCCCN1CCOCC1