Reaction Details
TargetCyclin-dependent kinase-like 3
LigandBDBM4851
Substrate/Competitorn/a
Meas. Tech.ChEMBL_774302 (CHEMBL1908519)
Kd>10000±n/a nM
Citation Davis, MIHunt, JPHerrgard, SCiceri, PWodicka, LMPallares, GHocker, MTreiber, DKZarrinkar, PP Comprehensive analysis of kinase inhibitor selectivity. Nat Biotechnol29:1046-51 (2011) 
 
Cyclin-dependent kinase-like 3
Name:Cyclin-dependent kinase-like 3
Type:PROTEIN
Mol. Mass.:67544.66
Organism:Homo sapiens (Human)
Description:ChEMBL_774302
Residue:592
BDBM4851
NameBDBM4851
Synonyms:(4-chlorophenyl)-[4-(4-pyridylmethyl)phthalazin-1-yl]amine CGP 79787 CHEMBL75232 N-(4-chlorophenyl)-4-(pyridin-4-ylmethyl)phthalazin-1-amine PTK787 cid_151194
TypeSmall organic molecule
Emp. Form.C20H15ClN4
Mol. Mass.346.813
SMILESClc1ccc(Nc2nnc(Cc3ccncc3)c3ccccc23)cc1