Reaction Details
TargetMitogen-activated protein kinase 6
LigandBDBM21
Substrate/Competitorn/a
Meas. Tech.ChEMBL_774367 (CHEMBL1908584)
Kd 1500±n/a nM
Citation Davis, MIHunt, JPHerrgard, SCiceri, PWodicka, LMPallares, GHocker, MTreiber, DKZarrinkar, PP Comprehensive analysis of kinase inhibitor selectivity. Nat Biotechnol29:1046-51 (2011) 
 
Mitogen-activated protein kinase 6
Name:Mitogen-activated protein kinase 6
Type:PROTEIN
Mol. Mass.:82643.07
Organism:Homo sapiens (Human)
Description:ChEMBL_774367
Residue:721
BDBM21
NameBDBM21
Synonyms:CHEMBL24828 VANDETANIB ZD6474 | cid_3081361
Typen/a
Emp. Form.C22H24BrFN4O2
Mol. Mass.475.354
SMILESCOc1cc2c(Nc3ccc(Br)cc3F)ncnc2cc1OCC1CCN(C)CC1