Reaction Details
TargetMitogen-activated protein kinase kinase kinase 19
LigandBDBM4814
Substrate/Competitorn/a
Meas. Tech.ChEMBL_774616 (CHEMBL1908833)
Kd 17±n/a nM
Citation Davis, MIHunt, JPHerrgard, SCiceri, PWodicka, LMPallares, GHocker, MTreiber, DKZarrinkar, PP Comprehensive analysis of kinase inhibitor selectivity. Nat Biotechnol29:1046-51 (2011) 
 
Mitogen-activated protein kinase kinase kinase 19
Name:Mitogen-activated protein kinase kinase kinase 19
Type:PROTEIN
Mol. Mass.:150549.39
Organism:Homo sapiens (Human)
Description:ChEMBL_774616
Residue:1328
BDBM4814
NameBDBM4814
Synonyms:CHEMBL535 N-[2-(diethylamino)ethyl]-5-{[(3Z)-5-fluoro-2-oxo-2,3-dihydro-1H-indol-3-ylidene]methyl}-2,4-dimethyl-1H-pyrrole-3-carboxamide SUNITINIB US10464902, Sunitinib US9914707, SU11248
TypeSmall organic molecule
Emp. Form.C22H27FN4O2
Mol. Mass.398.4738
SMILESCCN(CC)CCNC(=O)c1c(C)[nH]c(\C=C2/C(=O)Nc3ccc(F)cc23)c1C