Reaction Details
TargetCyclin-dependent kinase-like 1 [2-358]
LigandBDBM31085
Substrate/Competitorn/a
Meas. Tech.ChEMBL_774421 (CHEMBL1908638)
Kd 13±n/a nM
Citation Davis, MIHunt, JPHerrgard, SCiceri, PWodicka, LMPallares, GHocker, MTreiber, DKZarrinkar, PP Comprehensive analysis of kinase inhibitor selectivity. Nat Biotechnol29:1046-51 (2011) 
 
Cyclin-dependent kinase-like 1 [2-358]
Name:Cyclin-dependent kinase-like 1 [2-358]
Type:PROTEIN
Mol. Mass.:41689.97
Organism:Homo sapiens (Human)
Description:ChEMBL_774421
Residue:357
BDBM31085
NameBDBM31085
Synonyms:1-[4-[(4-ethyl-1-piperazinyl)methyl]-3-(trifluoromethyl)phenyl]-3-[4-[[6-(methylamino)-4-pyrimidinyl]oxy]phenyl]urea 1-[4-[(4-ethylpiperazino)methyl]-3-(trifluoromethyl)phenyl]-3-[4-[6-(methylamino)pyrimidin-4-yl]oxyphenyl]urea cid_11409972
TypeSmall organic molecule
Emp. Form.C26H30F3N7O2
Mol. Mass.529.5573
SMILESCCN1CCN(Cc2ccc(NC(=O)Nc3ccc(Oc4cc(NC)ncn4)cc3)cc2C(F)(F)F)CC1