Reaction Details
TargetSerine/threonine-protein kinase TAO2
LigandBDBM13216
Substrate/Competitorn/a
Meas. Tech.ChEMBL_774579 (CHEMBL1908796)
Kd 5400±n/a nM
Citation Davis, MIHunt, JPHerrgard, SCiceri, PWodicka, LMPallares, GHocker, MTreiber, DKZarrinkar, PP Comprehensive analysis of kinase inhibitor selectivity. Nat Biotechnol29:1046-51 (2011) 
 
Serine/threonine-protein kinase TAO2
Name:Serine/threonine-protein kinase TAO2
Type:Enzyme
Mol. Mass.:138262.36
Organism:Homo sapiens (Human)
Description:Q9UL54
Residue:1235
BDBM13216
NameBDBM13216
Synonyms:BMS-354825 DASATINIB N-(2-chloro-6-methylphenyl)-2-({6-[4-(2-hydroxyethyl)piperazin-1-yl]-2-methylpyrimidin-4-yl}amino)-1,3-thiazole-5-carboxamide US20230348453, Compound A8 med.21724, Compound Dasatinib
TypeSmall organic molecule
Emp. Form.C22H26ClN7O2S
Mol. Mass.488.006
SMILESCc1nc(Nc2ncc(s2)C(=O)Nc2c(C)cccc2Cl)cc(n1)N1CCN(CCO)CC1