Reaction Details
TargetSerine/threonine-protein kinase TAO3
LigandBDBM15138
Substrate/Competitorn/a
Meas. Tech.ChEMBL_774581 (CHEMBL1908798)
Kd 1100±n/a nM
Citation Davis, MIHunt, JPHerrgard, SCiceri, PWodicka, LMPallares, GHocker, MTreiber, DKZarrinkar, PP Comprehensive analysis of kinase inhibitor selectivity. Nat Biotechnol29:1046-51 (2011) 
 
Serine/threonine-protein kinase TAO3
Name:Serine/threonine-protein kinase TAO3
Type:PROTEIN
Mol. Mass.:105420.26
Organism:Homo sapiens (Human)
Description:ChEMBL_774581
Residue:898
BDBM15138
NameBDBM15138
Synonyms:5-indazolyl pyridine 11g A-674563 indazole-pyridine, 7
TypeSmall organic molecule
Emp. Form.C22H22N4O
Mol. Mass.358.4363
SMILESCc1n[nH]c2ccc(cc12)-c1cncc(OC[C@@H](N)Cc2ccccc2)c1