Reaction Details
TargetMicrotubule-associated serine/threonine-protein kinase 1
LigandBDBM25919
Substrate/Competitorn/a
Meas. Tech.ChEMBL_774571 (CHEMBL1908788)
Kd>10000±n/a nM
Citation Davis, MIHunt, JPHerrgard, SCiceri, PWodicka, LMPallares, GHocker, MTreiber, DKZarrinkar, PP Comprehensive analysis of kinase inhibitor selectivity. Nat Biotechnol29:1046-51 (2011) 
 
Microtubule-associated serine/threonine-protein kinase 1
Name:Microtubule-associated serine/threonine-protein kinase 1
Type:PROTEIN
Mol. Mass.:170710.79
Organism:Homo sapiens (Human)
Description:ChEMBL_774571
Residue:1570
BDBM25919
NameBDBM25919
Synonyms:BMS-345541 CHEMBL471496 | N-(2-aminoethyl)-3,12-dimethyl-2,5,8-triazatricyclo[7.4.0.0^{2,6}]trideca-1(13),3,5,7,9,11-hexaen-7-amine
TypeSmall organic molecule
Emp. Form.C14H17N5
Mol. Mass.255.3183
SMILESCc1cnc2c(NCCN)nc3ccc(C)cc3n12