Reaction Details
Target3-phosphoinositide-dependent protein kinase 1
LigandBDBM50355499
Substrate/Competitorn/a
Meas. Tech.ChEMBL_774356 (CHEMBL1908573)
Kd 3900±n/a nM
Citation Davis, MIHunt, JPHerrgard, SCiceri, PWodicka, LMPallares, GHocker, MTreiber, DKZarrinkar, PP Comprehensive analysis of kinase inhibitor selectivity. Nat Biotechnol29:1046-51 (2011) 
 
3-phosphoinositide-dependent protein kinase 1
Name:3-phosphoinositide-dependent protein kinase 1
Type:Enzyme
Mol. Mass.:63157.65
Organism:Homo sapiens (Human)
Description:O15530
Residue:556
BDBM50355499
NameBDBM50355499
Synonyms:CHEMBL1908395 | CHEMBL1908842
TypeSmall organic molecule
Emp. Form.C26H32N6O2
Mol. Mass.460.5713
SMILESCN(C)CC(=O)N1CCC(CC1)c1ccc(NC(=O)c2ncc([nH]2)C#N)c(c1)C1=CCCCC1