Reaction Details
TargetSerine/threonine-protein kinase SIK2
LigandBDBM21
Substrate/Competitorn/a
Meas. Tech.ChEMBL_774575 (CHEMBL1908792)
Kd 430±n/a nM
Citation Davis, MIHunt, JPHerrgard, SCiceri, PWodicka, LMPallares, GHocker, MTreiber, DKZarrinkar, PP Comprehensive analysis of kinase inhibitor selectivity. Nat Biotechnol29:1046-51 (2011) 
 
Serine/threonine-protein kinase SIK2
Name:Serine/threonine-protein kinase SIK2
Type:Protein
Mol. Mass.:103906.53
Organism:Homo sapiens (Human)
Description:n/a
Residue:926
BDBM21
NameBDBM21
Synonyms:CHEMBL24828 VANDETANIB ZD6474 | cid_3081361
Typen/a
Emp. Form.C22H24BrFN4O2
Mol. Mass.475.354
SMILESCOc1cc2c(Nc3ccc(Br)cc3F)ncnc2cc1OCC1CCN(C)CC1