Reaction Details
TargetReceptor-interacting serine/threonine-protein kinase 1
LigandBDBM27817
Substrate/Competitorn/a
Meas. Tech.ChEMBL_774404 (CHEMBL1908621)
Kd>10000±n/a nM
Citation Davis, MIHunt, JPHerrgard, SCiceri, PWodicka, LMPallares, GHocker, MTreiber, DKZarrinkar, PP Comprehensive analysis of kinase inhibitor selectivity. Nat Biotechnol29:1046-51 (2011) 
 
Receptor-interacting serine/threonine-protein kinase 1
Name:Receptor-interacting serine/threonine-protein kinase 1
Type:Enzyme Catalytic Domain
Mol. Mass.:75926.99
Organism:Homo sapiens (Human)
Description:Q13546
Residue:671
BDBM27817
NameBDBM27817
Synonyms:2-{[2-({1-[2-(dimethylamino)acetyl]-5-methoxy-2,3-dihydro-1H-indol-6-yl}amino)-7H-pyrrolo[2,3-d]pyrimidin-4-yl]amino}-6-fluoro-N-methylbenzamide | pyrrolo[2,3-d]pyrimidine deriv., 40
TypeSmall organic molecule
Emp. Form.C27H29FN8O3
Mol. Mass.532.5694
SMILESCNC(=O)c1c(F)cccc1Nc1nc(Nc2cc3N(CCc3cc2OC)C(=O)CN(C)C)nc2[nH]ccc12