Reaction Details
TargetSerine/threonine-protein kinase LATS2
LigandBDBM26474
Substrate/Competitorn/a
Meas. Tech.ChEMBL_774563 (CHEMBL1908780)
Kd>10000±n/a nM
Citation Davis, MIHunt, JPHerrgard, SCiceri, PWodicka, LMPallares, GHocker, MTreiber, DKZarrinkar, PP Comprehensive analysis of kinase inhibitor selectivity. Nat Biotechnol29:1046-51 (2011) 
 
Serine/threonine-protein kinase LATS2
Name:Serine/threonine-protein kinase LATS2
Type:PROTEIN
Mol. Mass.:120160.09
Organism:Homo sapiens (Human)
Description:ChEMBL_587187
Residue:1088
BDBM26474
NameBDBM26474
Synonyms:5-({4-[(2,3-dimethyl-2H-indazol-6-yl)(methyl)amino]pyrimidin-2-yl}amino)-2-methylbenzene-1-sulfonamide JMC514632 Compound 13 cid_10113978
TypeSmall organic molecule
Emp. Form.C21H23N7O2S
Mol. Mass.437.518
SMILESCN(c1ccc2c(C)n(C)nc2c1)c1ccnc(Nc2ccc(C)c(c2)S(N)(=O)=O)n1