Reaction Details
TargetALK tyrosine kinase receptor
LigandBDBM50306682
Substrate/Competitorn/a
Meas. Tech.ChEMBL_774424 (CHEMBL1908641)
Kd 3.3±n/a nM
Citation Davis, MIHunt, JPHerrgard, SCiceri, PWodicka, LMPallares, GHocker, MTreiber, DKZarrinkar, PP Comprehensive analysis of kinase inhibitor selectivity. Nat Biotechnol29:1046-51 (2011) 
 
ALK tyrosine kinase receptor
Name:ALK tyrosine kinase receptor
Type:Protein
Mol. Mass.:176453.10
Organism:Homo sapiens (Human)
Description:Q9UM73
Residue:1620
BDBM50306682
NameBDBM50306682
Synonyms:(R)-3-(1-(2,6-dichloro-3-fluorophenyl)ethoxy)-5-(1-(piperidin-4-yl)-1H-pyrazol-4-yl)pyridin-2-amine 3-[(1R)-1-(2,6-dichloro-3-fluorophenyl)ethoxy]-5-(1-piperidin-4-yl-1H-pyrazol-4-yl)pyridin-2-amine CRIZOTINIB US10370379, Crizotinib US10780082, Compound Crizotinib US11517561, Compound Crizotinib US9199944, Crizotinib | US9226923, Crizotinib
TypeSmall organic molecule
Emp. Form.C21H22Cl2FN5O
Mol. Mass.450.337
SMILESC[C@@H](Oc1cc(cnc1N)-c1cnn(c1)C1CCNCC1)c1c(Cl)ccc(F)c1Cl