Reaction Details
TargetDual specificity tyrosine-phosphorylation-regulated kinase 2
LigandBDBM50355499
Substrate/Competitorn/a
Meas. Tech.ChEMBL_774398 (CHEMBL1908615)
Kd>10000±n/a nM
Citation Davis, MIHunt, JPHerrgard, SCiceri, PWodicka, LMPallares, GHocker, MTreiber, DKZarrinkar, PP Comprehensive analysis of kinase inhibitor selectivity. Nat Biotechnol29:1046-51 (2011) 
 
Dual specificity tyrosine-phosphorylation-regulated kinase 2
Name:Dual specificity tyrosine-phosphorylation-regulated kinase 2
Type:PROTEIN
Mol. Mass.:66690.69
Organism:Homo sapiens (Human)
Description:ChEMBL_1508025
Residue:601
BDBM50355499
NameBDBM50355499
Synonyms:CHEMBL1908395 | CHEMBL1908842
TypeSmall organic molecule
Emp. Form.C26H32N6O2
Mol. Mass.460.5713
SMILESCN(C)CC(=O)N1CCC(CC1)c1ccc(NC(=O)c2ncc([nH]2)C#N)c(c1)C1=CCCCC1