Reaction Details
TargetPhosphatidylinositol 5-phosphate 4-kinase type-2 beta
LigandBDBM50355500
Substrate/Competitorn/a
Meas. Tech.ChEMBL_774395 (CHEMBL1908612)
Kd 4500±n/a nM
Citation Davis, MIHunt, JPHerrgard, SCiceri, PWodicka, LMPallares, GHocker, MTreiber, DKZarrinkar, PP Comprehensive analysis of kinase inhibitor selectivity. Nat Biotechnol29:1046-51 (2011) 
 
Phosphatidylinositol 5-phosphate 4-kinase type-2 beta
Name:Phosphatidylinositol 5-phosphate 4-kinase type-2 beta
Type:PROTEIN
Mol. Mass.:47382.97
Organism:Homo sapiens (Human)
Description:ChEMBL_774395
Residue:416
BDBM50355500
NameBDBM50355500
Synonyms:CHEMBL1908394 | US9695172, GSK461364
TypeSmall organic molecule
Emp. Form.C27H28F3N5O2S
Mol. Mass.543.604
SMILESC[C@@H](Oc1cc(sc1C(N)=O)-n1cnc2ccc(CN3CCN(C)CC3)cc12)c1ccccc1C(F)(F)F