Reaction Details
TargetNon-receptor tyrosine-protein kinase TNK1
LigandBDBM50237710
Substrate/Competitorn/a
Meas. Tech.ChEMBL_774410 (CHEMBL1908627)
Kd>10000±n/a nM
Citation Davis, MIHunt, JPHerrgard, SCiceri, PWodicka, LMPallares, GHocker, MTreiber, DKZarrinkar, PP Comprehensive analysis of kinase inhibitor selectivity. Nat Biotechnol29:1046-51 (2011) 
 
Non-receptor tyrosine-protein kinase TNK1
Name:Non-receptor tyrosine-protein kinase TNK1
Type:PROTEIN
Mol. Mass.:72495.61
Organism:Homo sapiens (Human)
Description:ChEMBL_774410
Residue:666
BDBM50237710
NameBDBM50237710
Synonyms:4-methyl-N-[3-(4-methyl-1H-imidazol-1-yl)-5-(trifluoromethyl)phenyl]-3-[(4-pyridin-3-ylpyrimidin-2-yl)amino]benzamide AMN107 NILOTINIB | US11649218, Example Nilotinib
TypeSmall organic molecule
Emp. Form.C28H22F3N7O
Mol. Mass.529.5158
SMILESCc1cn(cn1)-c1cc(NC(=O)c2ccc(C)c(Nc3nccc(n3)-c3cccnc3)c2)cc(c1)C(F)(F)F