Reaction Details
TargetTyrosine-protein kinase FRK
LigandBDBM50355501
Substrate/Competitorn/a
Meas. Tech.ChEMBL_774335 (CHEMBL1908552)
Kd>10000±n/a nM
Citation Davis, MIHunt, JPHerrgard, SCiceri, PWodicka, LMPallares, GHocker, MTreiber, DKZarrinkar, PP Comprehensive analysis of kinase inhibitor selectivity. Nat Biotechnol29:1046-51 (2011) 
 
Tyrosine-protein kinase FRK
Name:Tyrosine-protein kinase FRK
Type:Tyrosine-protein kinase
Mol. Mass.:58254.41
Organism:Homo sapiens (Human)
Description:P42685
Residue:505
BDBM50355501
NameBDBM50355501
Synonyms:INCB-018424 RUXOLITINIB PHOSPHATE US10766894, Compound TABLE 1.1 US11203595, TABLE 1.1 | US11279703, TABLE 6.147
TypeSmall organic molecule
Emp. Form.C17H18N6
Mol. Mass.306.365
SMILESN#CC[C@H](C1CCCC1)n1cc(cn1)-c1ncnc2[nH]ccc12