Reaction Details
TargetPotassium voltage-gated channel subfamily H member 2
LigandBDBM50355505
Substrate/Competitorn/a
Meas. Tech.ChEMBL_776445 (CHEMBL1913542)
Ki 2100±n/a nM
Citation Chen, ACauchon, EChefson, ADolman, SDucharme, YDubé, DFalgueyret, JPFournier, PAGagné, SGallant, MGrimm, EHan, YHoule, RHuang, JQHughes, GJûteau, HLacombe, PLauzon, SLévesque, JFLiu, SMacdonald, DMackay, BMcKay, DPercival, MDSt-Jacques, RToulmond, S Renin inhibitors for the treatment of hypertension: design and optimization of a novel series of tertiary alcohol-bearing piperidines. Bioorg Med Chem Lett21:3976-81 (2011) 
 
Potassium voltage-gated channel subfamily H member 2
Name:Potassium voltage-gated channel subfamily H member 2
Type:Multi-pass membrane protein
Mol. Mass.:126672.65
Organism:Homo sapiens (Human)
Description:Q12809
Residue:1159
BDBM50355505
NameBDBM50355505
Synonyms:CHEMBL1909649
TypeSmall organic molecule
Emp. Form.C28H31F3N4O4
Mol. Mass.544.5653
SMILESCON(C)C(=O)Cn1cc(CN(C2CC2)C(=O)[C@H]2CNCC[C@]2(O)c2ccc(F)c(F)c2)c2c(F)cccc12