Reaction Details
TargetRenin
LigandBDBM50355514
Substrate/Competitorn/a
Meas. Tech.ChEMBL_776436 (CHEMBL1913533)
IC50 330±n/a nM
Citation Chen, ACauchon, EChefson, ADolman, SDucharme, YDubé, DFalgueyret, JPFournier, PAGagné, SGallant, MGrimm, EHan, YHoule, RHuang, JQHughes, GJûteau, HLacombe, PLauzon, SLévesque, JFLiu, SMacdonald, DMackay, BMcKay, DPercival, MDSt-Jacques, RToulmond, S Renin inhibitors for the treatment of hypertension: design and optimization of a novel series of tertiary alcohol-bearing piperidines. Bioorg Med Chem Lett21:3976-81 (2011) 
 
Renin
Name:Renin
Type:Enzyme
Mol. Mass.:45058.99
Organism:Homo sapiens (Human)
Description:n/a
Residue:406
BDBM50355514
NameBDBM50355514
Synonyms:CHEMBL1910316
TypeSmall organic molecule
Emp. Form.C32H30F5N3O3
Mol. Mass.599.5909
SMILESO[C@@]1(CCNC[C@@H]1C(=O)N(Cc1cn(Cc2ccccc2OC(F)F)c2cccc(F)c12)C1CC1)c1ccc(F)c(F)c1