Reaction Details
TargetRenin
LigandBDBM50355522
Substrate/Competitorn/a
Meas. Tech.ChEMBL_776557 (CHEMBL1913654)
IC50 0.04±n/a nM
Citation Chen, ACauchon, EChefson, ADolman, SDucharme, YDubé, DFalgueyret, JPFournier, PAGagné, SGallant, MGrimm, EHan, YHoule, RHuang, JQHughes, GJûteau, HLacombe, PLauzon, SLévesque, JFLiu, SMacdonald, DMackay, BMcKay, DPercival, MDSt-Jacques, RToulmond, S Renin inhibitors for the treatment of hypertension: design and optimization of a novel series of tertiary alcohol-bearing piperidines. Bioorg Med Chem Lett21:3976-81 (2011) 
 
Renin
Name:Renin
Type:Enzyme
Mol. Mass.:45058.99
Organism:Homo sapiens (Human)
Description:n/a
Residue:406
BDBM50355522
NameBDBM50355522
Synonyms:CHEMBL1910546
TypeSmall organic molecule
Emp. Form.C31H31F3N4O2
Mol. Mass.548.5986
SMILESCc1cc(Cn2cc(CN(C3CC3)C(=O)[C@H]3CNCC[C@]3(O)c3ccc(F)c(F)c3)c3c(F)cccc23)ccn1