Reaction Details
TargetRenin
LigandBDBM50355523
Substrate/Competitorn/a
Meas. Tech.ChEMBL_776436 (CHEMBL1913533)
IC50 42±n/a nM
Citation Chen, ACauchon, EChefson, ADolman, SDucharme, YDubé, DFalgueyret, JPFournier, PAGagné, SGallant, MGrimm, EHan, YHoule, RHuang, JQHughes, GJûteau, HLacombe, PLauzon, SLévesque, JFLiu, SMacdonald, DMackay, BMcKay, DPercival, MDSt-Jacques, RToulmond, S Renin inhibitors for the treatment of hypertension: design and optimization of a novel series of tertiary alcohol-bearing piperidines. Bioorg Med Chem Lett21:3976-81 (2011) 
 
Renin
Name:Renin
Type:Enzyme
Mol. Mass.:45058.99
Organism:Homo sapiens (Human)
Description:n/a
Residue:406
BDBM50355523
NameBDBM50355523
Synonyms:CHEMBL1910294
TypeSmall organic molecule
Emp. Form.C29H38F2N2O5
Mol. Mass.532.6192
SMILESCOCCCc1cc(CN(C2CC2)C(=O)C2CNCCC2(O)c2ccc(F)c(F)c2)cc(OCCOC)c1