Reaction Details
TargetPotassium voltage-gated channel subfamily H member 2
LigandBDBM50355528
Substrate/Competitorn/a
Meas. Tech.ChEMBL_776445 (CHEMBL1913542)
Ki 680±n/a nM
Citation Chen, ACauchon, EChefson, ADolman, SDucharme, YDubé, DFalgueyret, JPFournier, PAGagné, SGallant, MGrimm, EHan, YHoule, RHuang, JQHughes, GJûteau, HLacombe, PLauzon, SLévesque, JFLiu, SMacdonald, DMackay, BMcKay, DPercival, MDSt-Jacques, RToulmond, S Renin inhibitors for the treatment of hypertension: design and optimization of a novel series of tertiary alcohol-bearing piperidines. Bioorg Med Chem Lett21:3976-81 (2011) 
 
Potassium voltage-gated channel subfamily H member 2
Name:Potassium voltage-gated channel subfamily H member 2
Type:Multi-pass membrane protein
Mol. Mass.:126672.65
Organism:Homo sapiens (Human)
Description:Q12809
Residue:1159
BDBM50355528
NameBDBM50355528
Synonyms:CHEMBL1910295
TypeSmall organic molecule
Emp. Form.C22H22Cl2F2N2O2
Mol. Mass.455.325
SMILESO[C@@]1(CCNC[C@@H]1C(=O)N(Cc1cccc(Cl)c1Cl)C1CC1)c1ccc(F)c(F)c1