Reaction Details
TargetRenin
LigandBDBM50355533
Substrate/Competitorn/a
Meas. Tech.ChEMBL_776557 (CHEMBL1913654)
IC50 0.17±n/a nM
Citation Chen, ACauchon, EChefson, ADolman, SDucharme, YDubé, DFalgueyret, JPFournier, PAGagné, SGallant, MGrimm, EHan, YHoule, RHuang, JQHughes, GJûteau, HLacombe, PLauzon, SLévesque, JFLiu, SMacdonald, DMackay, BMcKay, DPercival, MDSt-Jacques, RToulmond, S Renin inhibitors for the treatment of hypertension: design and optimization of a novel series of tertiary alcohol-bearing piperidines. Bioorg Med Chem Lett21:3976-81 (2011) 
 
Renin
Name:Renin
Type:Enzyme
Mol. Mass.:45058.99
Organism:Homo sapiens (Human)
Description:n/a
Residue:406
BDBM50355533
NameBDBM50355533
Synonyms:CHEMBL1910299
TypeSmall organic molecule
Emp. Form.C24H24BrF2N3O2
Mol. Mass.504.367
SMILESO[C@@]1(CCNC[C@@H]1C(=O)N(Cc1c[nH]c2cccc(Br)c12)C1CC1)c1ccc(F)c(F)c1