Reaction Details
TargetRenin
LigandBDBM50355539
Substrate/Competitorn/a
Meas. Tech.ChEMBL_776557 (CHEMBL1913654)
IC50 0.4±n/a nM
Citation Chen, ACauchon, EChefson, ADolman, SDucharme, YDubé, DFalgueyret, JPFournier, PAGagné, SGallant, MGrimm, EHan, YHoule, RHuang, JQHughes, GJûteau, HLacombe, PLauzon, SLévesque, JFLiu, SMacdonald, DMackay, BMcKay, DPercival, MDSt-Jacques, RToulmond, S Renin inhibitors for the treatment of hypertension: design and optimization of a novel series of tertiary alcohol-bearing piperidines. Bioorg Med Chem Lett21:3976-81 (2011) 
 
Renin
Name:Renin
Type:Enzyme
Mol. Mass.:45058.99
Organism:Homo sapiens (Human)
Description:n/a
Residue:406
BDBM50355539
NameBDBM50355539
Synonyms:CHEMBL1910305
TypeSmall organic molecule
Emp. Form.C33H41F3N4O4
Mol. Mass.614.6982
SMILESCOCCCn1cc(CN(C2CC2)C(=O)[C@H]2CNCC[C@]2(O)c2ccc(F)c(F)c2)c2c(F)ccc(CN3CCOCC3)c12