Reaction Details
TargetLactoylglutathione lyase
LigandBDBM50355547
Substrate/Competitorn/a
Meas. Tech.ChEMBL_776454 (CHEMBL1913551)
IC50 2000±n/a nM
Citation Takasawa, RTao, ASaeki, KShionozaki, NTanaka, RUchiro, HTakahashi, SYoshimori, ATanuma, S Discovery of a new type inhibitor of human glyoxalase I by myricetin-based 4-point pharmacophore. Bioorg Med Chem Lett21:4337-42 (2011) 
 
Lactoylglutathione lyase
Name:Lactoylglutathione lyase
Type:Enzyme
Mol. Mass.:20772.95
Organism:Homo sapiens (Human)
Description:Q04760
Residue:184
BDBM50355547
NameBDBM50355547
Synonyms:CHEMBL1910548
TypeSmall organic molecule
Emp. Form.C18H15NO3S
Mol. Mass.325.382
SMILESCOc1ccc(\C=C(\CC(O)=O)c2nc3ccccc3s2)cc1