Reaction Details
TargetLactoylglutathione lyase
LigandBDBM50355548
Substrate/Competitorn/a
Meas. Tech.ChEMBL_776454 (CHEMBL1913551)
IC50 54600±n/a nM
Citation Takasawa, RTao, ASaeki, KShionozaki, NTanaka, RUchiro, HTakahashi, SYoshimori, ATanuma, S Discovery of a new type inhibitor of human glyoxalase I by myricetin-based 4-point pharmacophore. Bioorg Med Chem Lett21:4337-42 (2011) 
 
Lactoylglutathione lyase
Name:Lactoylglutathione lyase
Type:Enzyme
Mol. Mass.:20772.95
Organism:Homo sapiens (Human)
Description:Q04760
Residue:184
BDBM50355548
NameBDBM50355548
Synonyms:CHEMBL1910549
TypeSmall organic molecule
Emp. Form.C17H17NO4S
Mol. Mass.331.386
SMILESCOc1ccc(cc1)C(=O)Nc1sc2CCCCc2c1C(O)=O