Reaction Details
TargetSerine/threonine-protein kinase Chk1
LigandBDBM50355559
Substrate/Competitorn/a
Meas. Tech.ChEMBL_776689 (CHEMBL1913786)
IC50>100000±n/a nM
Citation Andreani, AGranaiola, MLeoni, ALocatelli, AMorigi, RRambaldi, MVaroli, LLannigan, DSmith, JScudiero, DKondapaka, SShoemaker, RH Imidazo[2,1-b]thiazole guanylhydrazones as RSK2 inhibitors. Eur J Med Chem46:4311-23 (2011) 
 
Serine/threonine-protein kinase Chk1
Name:Serine/threonine-protein kinase Chk1
Type:Enzyme Catalytic Domain
Mol. Mass.:54443.02
Organism:Homo sapiens (Human)
Description:gi_166295192
Residue:476
BDBM50355559
NameBDBM50355559
Synonyms:CHEMBL1910627
TypeSmall organic molecule
Emp. Form.C15H12ClN7O2
Mol. Mass.357.754
SMILES[#7]\[#6](-[#7])=[#7]\[#7]=[#6]-c1c(nc2ccccn12)-c1ccc(Cl)c(c1)-[#7+](-[#8-])=O