Reaction Details
TargetSerine/threonine-protein kinase Chk1
LigandBDBM50355604
Substrate/Competitorn/a
Meas. Tech.ChEMBL_776689 (CHEMBL1913786)
IC50>20000±n/a nM
Citation Andreani, AGranaiola, MLeoni, ALocatelli, AMorigi, RRambaldi, MVaroli, LLannigan, DSmith, JScudiero, DKondapaka, SShoemaker, RH Imidazo[2,1-b]thiazole guanylhydrazones as RSK2 inhibitors. Eur J Med Chem46:4311-23 (2011) 
 
Serine/threonine-protein kinase Chk1
Name:Serine/threonine-protein kinase Chk1
Type:Enzyme Catalytic Domain
Mol. Mass.:54443.02
Organism:Homo sapiens (Human)
Description:gi_166295192
Residue:476
BDBM50355604
NameBDBM50355604
Synonyms:CHEMBL1910758
TypeSmall organic molecule
Emp. Form.C15H13Cl2N7O2S
Mol. Mass.426.28
SMILESCCc1cn2c(\C=N\NC(N)=N)c(nc2s1)-c1cc(c(Cl)cc1Cl)[N+]([O-])=O