Reaction Details
TargetSerine/threonine-protein kinase Chk2
LigandBDBM50355568
Substrate/Competitorn/a
Meas. Tech.ChEMBL_776643 (CHEMBL1913740)
IC50>100000±n/a nM
Citation Andreani, AGranaiola, MLeoni, ALocatelli, AMorigi, RRambaldi, MVaroli, LLannigan, DSmith, JScudiero, DKondapaka, SShoemaker, RH Imidazo[2,1-b]thiazole guanylhydrazones as RSK2 inhibitors. Eur J Med Chem46:4311-23 (2011) 
 
Serine/threonine-protein kinase Chk2
Name:Serine/threonine-protein kinase Chk2
Type:Protein
Mol. Mass.:60908.59
Organism:Homo sapiens (Human)
Description:O96017
Residue:543
BDBM50355568
NameBDBM50355568
Synonyms:CHEMBL1910636
TypeSmall organic molecule
Emp. Form.C16H15Cl2N7O2S
Mol. Mass.440.307
SMILESCCCc1cn2c(\C=N\NC(N)=N)c(nc2s1)-c1cc(c(Cl)cc1Cl)[N+]([O-])=O