Reaction Details
TargetRibosomal protein S6 kinase alpha-3
LigandBDBM50355594
Substrate/Competitorn/a
Meas. Tech.ChEMBL_776690 (CHEMBL1913787)
IC50>100000±n/a nM
Citation Andreani, AGranaiola, MLeoni, ALocatelli, AMorigi, RRambaldi, MVaroli, LLannigan, DSmith, JScudiero, DKondapaka, SShoemaker, RH Imidazo[2,1-b]thiazole guanylhydrazones as RSK2 inhibitors. Eur J Med Chem46:4311-23 (2011) 
 
Ribosomal protein S6 kinase alpha-3
Name:Ribosomal protein S6 kinase alpha-3
Type:Serine/threonine-protein kinase
Mol. Mass.:83740.03
Organism:Homo sapiens (Human)
Description:The human RSK2 sequence differed from the Genbank entry NM_004586 at one residue, V45G. The protein was cloned and purified from baculovirus expression system.
Residue:740
BDBM50355594
NameBDBM50355594
Synonyms:CHEMBL1910603
TypeSmall organic molecule
Emp. Form.C13H10FN7O2S
Mol. Mass.347.328
SMILESNC(=N)N\N=C/c1c(nc2sccn12)-c1cccc(c1F)[N+]([O-])=O