Reaction Details
TargetSerine/threonine-protein kinase Chk2
LigandBDBM50355594
Substrate/Competitorn/a
Meas. Tech.ChEMBL_776643 (CHEMBL1913740)
IC50>100000±n/a nM
Citation Andreani, AGranaiola, MLeoni, ALocatelli, AMorigi, RRambaldi, MVaroli, LLannigan, DSmith, JScudiero, DKondapaka, SShoemaker, RH Imidazo[2,1-b]thiazole guanylhydrazones as RSK2 inhibitors. Eur J Med Chem46:4311-23 (2011) 
 
Serine/threonine-protein kinase Chk2
Name:Serine/threonine-protein kinase Chk2
Type:Protein
Mol. Mass.:60908.59
Organism:Homo sapiens (Human)
Description:O96017
Residue:543
BDBM50355594
NameBDBM50355594
Synonyms:CHEMBL1910603
TypeSmall organic molecule
Emp. Form.C13H10FN7O2S
Mol. Mass.347.328
SMILESNC(=N)N\N=C/c1c(nc2sccn12)-c1cccc(c1F)[N+]([O-])=O