Reaction Details
TargetSerine/threonine-protein kinase Chk2
LigandBDBM50355596
Substrate/Competitorn/a
Meas. Tech.ChEMBL_776643 (CHEMBL1913740)
IC50>20000±n/a nM
Citation Andreani, AGranaiola, MLeoni, ALocatelli, AMorigi, RRambaldi, MVaroli, LLannigan, DSmith, JScudiero, DKondapaka, SShoemaker, RH Imidazo[2,1-b]thiazole guanylhydrazones as RSK2 inhibitors. Eur J Med Chem46:4311-23 (2011) 
 
Serine/threonine-protein kinase Chk2
Name:Serine/threonine-protein kinase Chk2
Type:Protein
Mol. Mass.:60908.59
Organism:Homo sapiens (Human)
Description:O96017
Residue:543
BDBM50355596
NameBDBM50355596
Synonyms:CHEMBL1910624
TypeSmall organic molecule
Emp. Form.C15H12Cl2N6S
Mol. Mass.379.267
SMILESClc1cc(c(Cl)s1)-c1nc2ccccn2c1-[#6]=[#7]\[#7]=[#6]-1/[#7]-[#6]-[#6]-[#7]-1