Reaction Details
TargetSerine/threonine-protein kinase Chk2
LigandBDBM50355597
Substrate/Competitorn/a
Meas. Tech.ChEMBL_776643 (CHEMBL1913740)
IC50>100000±n/a nM
Citation Andreani, AGranaiola, MLeoni, ALocatelli, AMorigi, RRambaldi, MVaroli, LLannigan, DSmith, JScudiero, DKondapaka, SShoemaker, RH Imidazo[2,1-b]thiazole guanylhydrazones as RSK2 inhibitors. Eur J Med Chem46:4311-23 (2011) 
 
Serine/threonine-protein kinase Chk2
Name:Serine/threonine-protein kinase Chk2
Type:Protein
Mol. Mass.:60908.59
Organism:Homo sapiens (Human)
Description:O96017
Residue:543
BDBM50355597
NameBDBM50355597
Synonyms:CHEMBL1910751
TypeSmall organic molecule
Emp. Form.C14H13ClN8O2S
Mol. Mass.392.823
SMILESCc1cn2c(\C=N\NC(=N)NN)c(nc2s1)-c1ccc(Cl)c(c1)[N+]([O-])=O