Reaction Details
TargetMuscarinic acetylcholine receptor M3
LigandBDBM50355611
Substrate/Competitorn/a
Meas. Tech.ChEMBL_776521 (CHEMBL1913618)
Ki 3.9±n/a nM
Citation Glossop, PAWatson, CAPrice, DABunnage, MEMiddleton, DSWood, AJames, KRoberts, DStrang, RSYeadon, MPerros-Huguet, CClarke, NPTrevethick, MAMachin, IStuart, EFEvans, SMHarrison, ACFairman, DAAgoram, BBurrows, JLFeeder, NFulton, CKDillon, BREntwistle, DASpence, FJ Inhalation by design: novel tertiary amine muscarinic M3 receptor antagonists with slow off-rate binding kinetics for inhaled once-daily treatment of chronic obstructive pulmonary disease. J Med Chem54:6888-904 (2011) 
 
Muscarinic acetylcholine receptor M3
Name:Muscarinic acetylcholine receptor M3
Type:Enzyme
Mol. Mass.:66151.03
Organism:Homo sapiens (Human)
Description:P20309
Residue:590
BDBM50355611
NameBDBM50355611
Synonyms:CHEMBL1910849
TypeSmall organic molecule
Emp. Form.C30H36N2O2
Mol. Mass.456.619
SMILESCC(C)(CCC(C(N)=O)(c1ccccc1)c1ccccc1)N1CCC(CC1)Oc1ccccc1