Reaction Details
TargetMuscarinic acetylcholine receptor M3
LigandBDBM50355626
Substrate/Competitorn/a
Meas. Tech.ChEMBL_776520 (CHEMBL1913617)
Ki 0.56±n/a nM
Citation Glossop, PAWatson, CAPrice, DABunnage, MEMiddleton, DSWood, AJames, KRoberts, DStrang, RSYeadon, MPerros-Huguet, CClarke, NPTrevethick, MAMachin, IStuart, EFEvans, SMHarrison, ACFairman, DAAgoram, BBurrows, JLFeeder, NFulton, CKDillon, BREntwistle, DASpence, FJ Inhalation by design: novel tertiary amine muscarinic M3 receptor antagonists with slow off-rate binding kinetics for inhaled once-daily treatment of chronic obstructive pulmonary disease. J Med Chem54:6888-904 (2011) 
 
Muscarinic acetylcholine receptor M3
Name:Muscarinic acetylcholine receptor M3
Type:Enzyme
Mol. Mass.:66151.03
Organism:Homo sapiens (Human)
Description:P20309
Residue:590
BDBM50355626
NameBDBM50355626
Synonyms:CHEMBL1910860
TypeSmall organic molecule
Emp. Form.C29H33FN2O3
Mol. Mass.476.5823
SMILESCC(C)(CCC(C(N)=O)(c1ccccc1)c1ccccc1)N1CC[C@H](C1)Oc1cc(O)cc(F)c1