Reaction Details
TargetMuscarinic acetylcholine receptor M1
LigandBDBM50355610
Substrate/Competitorn/a
Meas. Tech.ChEMBL_776583 (CHEMBL1913680)
Ki 0.433±n/a nM
Citation Glossop, PAWatson, CAPrice, DABunnage, MEMiddleton, DSWood, AJames, KRoberts, DStrang, RSYeadon, MPerros-Huguet, CClarke, NPTrevethick, MAMachin, IStuart, EFEvans, SMHarrison, ACFairman, DAAgoram, BBurrows, JLFeeder, NFulton, CKDillon, BREntwistle, DASpence, FJ Inhalation by design: novel tertiary amine muscarinic M3 receptor antagonists with slow off-rate binding kinetics for inhaled once-daily treatment of chronic obstructive pulmonary disease. J Med Chem54:6888-904 (2011) 
 
Muscarinic acetylcholine receptor M1
Name:Muscarinic acetylcholine receptor M1
Type:Protein
Mol. Mass.:51442.54
Organism:Homo sapiens (Human)
Description:P11229
Residue:460
BDBM50355610
NameBDBM50355610
Synonyms:CHEMBL1237108
TypeSmall organic molecule
Emp. Form.C20H30NO3
Mol. Mass.332.4566
SMILESCC(C)[N+]1(C)C2CCC1CC(C2)OC(=O)C(CO)c1ccccc1