Reaction Details
TargetProtein-arginine deiminase type-4
LigandBDBM50355666
Substrate/Competitorn/a
Meas. Tech.ChEMBL_776877 (CHEMBL1914011)
IC50>500000±n/a nM
Citation Causey, CPJones, JESlack, JLKamei, DJones, LESubramanian, VKnuckley, BEbrahimi, PChumanevich, AALuo, YHashimoto, HSato, MHofseth, LJThompson, PR The development of N-a-(2-carboxyl)benzoyl-N(5)-(2-fluoro-1-iminoethyl)-l-ornithine amide (o-F-amidine) and N-a-(2-carboxyl)benzoyl-N(5)-(2-chloro-1-iminoethyl)-l-ornithine amide (o-Cl-amidine) as second generation protein arginine deiminase (PAD) inhibitors. J Med Chem54:6919-35 (2011) 
 
Protein-arginine deiminase type-4
Name:Protein-arginine deiminase type-4
Type:Enzyme Catalytic Domain
Mol. Mass.:74078.90
Organism:Homo sapiens (Human)
Description:gi_216548487
Residue:663
BDBM50355666
NameBDBM50355666
Synonyms:CHEMBL1910977
TypeSmall organic molecule
Emp. Form.C8H9FN2
Mol. Mass.152.1689
SMILESNC(CF)=Nc1ccccc1