Reaction Details
TargetProtein-arginine deiminase type-3
LigandBDBM50355665
Substrate/Competitorn/a
Meas. Tech.ChEMBL_776880 (CHEMBL1914014)
Ki 29000±n/a nM
Citation Causey, CPJones, JESlack, JLKamei, DJones, LESubramanian, VKnuckley, BEbrahimi, PChumanevich, AALuo, YHashimoto, HSato, MHofseth, LJThompson, PR The development of N-a-(2-carboxyl)benzoyl-N(5)-(2-fluoro-1-iminoethyl)-l-ornithine amide (o-F-amidine) and N-a-(2-carboxyl)benzoyl-N(5)-(2-chloro-1-iminoethyl)-l-ornithine amide (o-Cl-amidine) as second generation protein arginine deiminase (PAD) inhibitors. J Med Chem54:6919-35 (2011) 
 
Protein-arginine deiminase type-3
Name:Protein-arginine deiminase type-3
Type:PROTEIN
Mol. Mass.:74727.86
Organism:Homo sapiens (Human)
Description:ChEMBL_1290378
Residue:664
BDBM50355665
NameBDBM50355665
Synonyms:CHEMBL1910971
TypeSmall organic molecule
Emp. Form.C15H19ClN4O4
Mol. Mass.354.789
SMILESNC(CCl)=NCCC[C@H](NC(=O)c1ccccc1C(O)=O)C(N)=O