Reaction Details
TargetProtein-arginine deiminase type-2
LigandBDBM50355657
Substrate/Competitorn/a
Meas. Tech.ChEMBL_776879 (CHEMBL1914013)
IC50 17000±n/a nM
Citation Causey, CPJones, JESlack, JLKamei, DJones, LESubramanian, VKnuckley, BEbrahimi, PChumanevich, AALuo, YHashimoto, HSato, MHofseth, LJThompson, PR The development of N-a-(2-carboxyl)benzoyl-N(5)-(2-fluoro-1-iminoethyl)-l-ornithine amide (o-F-amidine) and N-a-(2-carboxyl)benzoyl-N(5)-(2-chloro-1-iminoethyl)-l-ornithine amide (o-Cl-amidine) as second generation protein arginine deiminase (PAD) inhibitors. J Med Chem54:6919-35 (2011) 
 
Protein-arginine deiminase type-2
Name:Protein-arginine deiminase type-2
Type:PROTEIN
Mol. Mass.:75552.49
Organism:Homo sapiens (Human)
Description:ChEMBL_1290379
Residue:665
BDBM50355657
NameBDBM50355657
Synonyms:CHEMBL1910972 | CHEMBL1962361
TypeSmall organic molecule
Emp. Form.C14H19ClN4O2
Mol. Mass.310.779
SMILESNC(=O)[C@H](CCCN=C(N)CCl)NC(=O)c1ccccc1