Reaction Details
TargetPhosphatidylinositol 4,5-bisphosphate 3-kinase catalytic subunit delta isoform
LigandBDBM50355679
Substrate/Competitorn/a
Meas. Tech.ChEMBL_776277 (CHEMBL1914122)
IC50 2±n/a nM
Citation Rewcastle, GWGamage, SAFlanagan, JUFrederick, RDenny, WABaguley, BCKestell, PSingh, RKendall, JDMarshall, ESLill, CLLee, WJKolekar, SBuchanan, CMJamieson, SMShepherd, PR Synthesis and biological evaluation of novel analogues of the pan class I phosphatidylinositol 3-kinase (PI3K) inhibitor 2-(difluoromethyl)-1-[4,6-di(4-morpholinyl)-1,3,5-triazin-2-yl]-1H-benzimidazole (ZSTK474). J Med Chem54:7105-26 (2011) 
 
Phosphatidylinositol 4,5-bisphosphate 3-kinase catalytic subunit delta isoform
Name:Phosphatidylinositol 4,5-bisphosphate 3-kinase catalytic subunit delta isoform
Type:Enzyme Subunit
Mol. Mass.:119489.41
Organism:Homo sapiens (Human)
Description:O00329
Residue:1044
BDBM50355679
NameBDBM50355679
Synonyms:CHEMBL1911114
TypeSmall organic molecule
Emp. Form.C20H23F2N7O4
Mol. Mass.463.4379
SMILESCOc1ccc2n(c(nc2c1O)C(F)F)-c1nc(nc(n1)N1CCOCC1)N1CCOCC1